BDBM47963 2-[[(4-methoxyphenyl)-oxomethyl]amino]-4-methyl-5-thiazolecarboxylic acid prop-2-enyl ester::4-methyl-2-(p-anisoylamino)thiazole-5-carboxylic acid allyl ester::MLS000708508::SMR000287975::cid_2138172::prop-2-enyl 2-[(4-methoxybenzoyl)amino]-4-methyl-1,3-thiazole-5-carboxylate::prop-2-enyl 2-[(4-methoxyphenyl)carbonylamino]-4-methyl-1,3-thiazole-5-carboxylate
SMILES COc1ccc(cc1)C(=O)Nc1nc(C)c(s1)C(=O)OCC=C
InChI Key InChIKey=VHUJMINFUKKYKZ-UHFFFAOYSA-N
Data  1 IC50
  Tab Delimited (TSV)   2D SDfile   Computed 3D by Vconf -m prep SDfile
Find this compound or compounds like it in BindingDB:
Activity Spreadsheet -- Enzyme Inhibition Constant Data from BindingDB
Found 1 hit for monomerid = 47963
TargetHeat shock protein HSP 90-alpha(Homo sapiens (Human))
The Scripps Research Institute Molecular Screening Center
Curated by PubChem BioAssay
LigandPNGBDBM47963(2-[[(4-methoxyphenyl)-oxomethyl]amino]-4-methyl-5-...)
Affinity DataIC50:  3.58E+3nM. Assay description: Source (MLPCN Center Name): The Scripps Research Institute Molecular Screening Center (SRIMSC) Center Affiliation: The Scripps Research Institute (TS...
In DepthDetails PCBioAssay